Target
Palmitoleoyl-protein carboxylesterase NOTUM
Ligand
BDBM50361169
Substrate
Meas. Tech.
ChEMBL_1735027 (CHEMBL4150563)
IC50
200±n/a nM
Citation
 Suciu, RMCognetta, ABPotter, ZECravatt, BF Selective Irreversible Inhibitors of the Wnt-Deacylating Enzyme NOTUM Developed by Activity-Based Protein Profiling. ACS Med Chem Lett 9:563-568 (2018)  
Target
Name:
Palmitoleoyl-protein carboxylesterase NOTUM
Synonyms:
NOTUM Palmitoleoyl-protein carboxylesterase NOTUM | hNOTUM
Type:
PROTEIN
Mol. Mass.:
55706.36
Organism:
Homo sapiens (Human)
Description:
ChEMBL_116492
Residue:
496
  
Inhibitor
Name:
BDBM50361169
Synonyms:
CHEMBL4163486
Type:
Small organic molecule
Emp. Form.:
C25H28ClN5O5
Mol. Mass.:
513.973
SMILES:
COc1ccc(cc1)N1CCN(CC1)C(=O)ON1C(=O)C2CN(Cc3ccccc3Cl)CCN2C1=O
: