Target
Nuclear receptor corepressor 1
Ligand
BDBM50361177
Substrate
Meas. Tech.
ChEMBL_1735045 (CHEMBL4150581)
IC50
45±n/a nM
Citation
 Huang, YDong, GLi, HLiu, NZhang, WSheng, C Discovery of Janus Kinase 2 (JAK2) and Histone Deacetylase (HDAC) Dual Inhibitors as a Novel Strategy for the Combinational Treatment of Leukemia and Invasive Fungal Infections. J Med Chem 61:6056-6074 (2018)  
Target
Name:
Nuclear receptor corepressor 1
Synonyms:
KIAA1047 N-CoR1 NCOR1_HUMAN
Type:
PROTEIN
Mol. Mass.:
270226.27
Organism:
Homo sapiens (Human)
Description:
ChEMBL_107910
Residue:
2440
  
Inhibitor
Name:
BDBM50361177
Synonyms:
CHEMBL4160840
Type:
Small organic molecule
Emp. Form.:
C21H21N5O3
Mol. Mass.:
391.4231
SMILES:
ONC(=O)c1ccc(cc1)-c1ccnc(Nc2ccc(cc2)N2CCOCC2)n1
: