Target
Sodium- and chloride-dependent glycine transporter 1
Ligand
BDBM309315
Substrate
Meas. Tech.
ChEMBL_1735183 (CHEMBL4150719)
Ki
3.00±n/a nM
Citation
 Wang, YZhao, HBrewer, JTLi, HLao, YAmberg, WBehl, BAkritopoulou-Zanze, IDietrich, JLange, UEWPohlki, FHoft, CHornberger, WDjuric, SWSydor, JMezler, MRelo, ALVasudevan, A De Novo Design, Synthesis, and Biological Evaluation of 3,4-Disubstituted Pyrrolidine Sulfonamides as Potent and Selective Glycine Transporter 1 Competitive Inhibitors. J Med Chem 61:7486-7502 (2018)  
Target
Name:
Sodium- and chloride-dependent glycine transporter 1
Synonyms:
GlyT-1 Glycine Transporters (GlyT1c) SC6A9_HUMAN Sodium- and chloride-dependent glycine transporter 1 Sodium- and chloride-dependent glycine transporter 1 (GlyT1c) Solute carrier family 6 member 9
Type:
Enzyme
Mol. Mass.:
78270.54
Organism:
Homo sapiens (Human)
Description:
P48067
Residue:
706
  
Inhibitor
Name:
BDBM309315
Synonyms:
(3R,4S)-4-(4-fluorophenyl)-N-[4-fluoro-3-(trifluoromethyl)phenyl]-1-[(1-methyl-1H-1,2,3-triazol-4-yl)sulfonyl]pyrrolidin-3-amine | US9656955, Example 840
Type:
Small Organic Molecule
Emp. Form.:
C20H18F5N5O2S
Mol. Mass.:
487.446
SMILES:
Cn1cc(nn1)S(=O)(=O)N1C[C@H](Nc2ccc(F)c(c2)C(F)(F)F)[C@H](C1)c1ccc(F)cc1
: