Target
Sodium- and chloride-dependent glycine transporter 1
Ligand
BDBM50365386
Substrate
Meas. Tech.
ChEMBL_1735183 (CHEMBL4150719)
Ki
1160±n/a nM
Citation
 Wang, YZhao, HBrewer, JTLi, HLao, YAmberg, WBehl, BAkritopoulou-Zanze, IDietrich, JLange, UEWPohlki, FHoft, CHornberger, WDjuric, SWSydor, JMezler, MRelo, ALVasudevan, A De Novo Design, Synthesis, and Biological Evaluation of 3,4-Disubstituted Pyrrolidine Sulfonamides as Potent and Selective Glycine Transporter 1 Competitive Inhibitors. J Med Chem 61:7486-7502 (2018)  
Target
Name:
Sodium- and chloride-dependent glycine transporter 1
Synonyms:
GlyT-1 Glycine Transporters (GlyT1c) SC6A9_HUMAN Sodium- and chloride-dependent glycine transporter 1 Sodium- and chloride-dependent glycine transporter 1 (GlyT1c) Solute carrier family 6 member 9
Type:
Enzyme
Mol. Mass.:
78270.54
Organism:
Homo sapiens (Human)
Description:
P48067
Residue:
706
  
Inhibitor
Name:
BDBM50365386
Synonyms:
CHEMBL4167394
Type:
Small organic molecule
Emp. Form.:
C20H19F4N5O2S
Mol. Mass.:
469.456
SMILES:
Cn1cnc(c1)S(=O)(=O)N1CC(Nc2cncc(c2)C(F)(F)F)C(C1)c1ccc(F)cc1
: