Target
Sodium- and chloride-dependent glycine transporter 1
Ligand
BDBM309129
Substrate
Meas. Tech.
ChEMBL_1735183 (CHEMBL4150719)
Ki
2.00±n/a nM
Citation
 Wang, YZhao, HBrewer, JTLi, HLao, YAmberg, WBehl, BAkritopoulou-Zanze, IDietrich, JLange, UEWPohlki, FHoft, CHornberger, WDjuric, SWSydor, JMezler, MRelo, ALVasudevan, A De Novo Design, Synthesis, and Biological Evaluation of 3,4-Disubstituted Pyrrolidine Sulfonamides as Potent and Selective Glycine Transporter 1 Competitive Inhibitors. J Med Chem 61:7486-7502 (2018)  
Target
Name:
Sodium- and chloride-dependent glycine transporter 1
Synonyms:
GlyT-1 Glycine Transporters (GlyT1c) SC6A9_HUMAN Sodium- and chloride-dependent glycine transporter 1 Sodium- and chloride-dependent glycine transporter 1 (GlyT1c) Solute carrier family 6 member 9
Type:
Enzyme
Mol. Mass.:
78270.54
Organism:
Homo sapiens (Human)
Description:
P48067
Residue:
706
  
Inhibitor
Name:
BDBM309129
Synonyms:
(3R,4S)-4-(4-fluorophenyl)-N-[4-fluoro-3-(trifluoromethoxy)phenyl]-1-[(1-methyl-1H-imidazol-4-yl)sulfonyl]pyrrolidin-3-amine | US9656955, Example 651
Type:
Small Organic Molecule
Emp. Form.:
C21H19F5N4O3S
Mol. Mass.:
502.458
SMILES:
Cn1cnc(c1)S(=O)(=O)N1C[C@H](Nc2ccc(F)c(OC(F)(F)F)c2)[C@H](C1)c1ccc(F)cc1
: