Target
Cytochrome P450 2E1
Ligand
BDBM50366379
Substrate
Meas. Tech.
ChEMBL_1735371 (CHEMBL4150907)
IC50
1500±n/a nM
Citation
 Denton, TTSrivastava, PXia, ZChen, GWatson, CJWWynd, ALazarus, P Identification of the 4-Position of 3-Alkynyl and 3-Heteroaromatic Substituted Pyridine Methanamines as a Key Modification Site Eliciting Increased Potency and Enhanced Selectivity for Cytochrome P-450 2A6 Inhibition. J Med Chem 61:7065-7086 (2018)  
Target
Name:
Cytochrome P450 2E1
Synonyms:
CP2E1_HUMAN CYP2E1 | Cytochrome P450 2E1 (CYP2E1)
Type:
Enzyme
Mol. Mass.:
56860.34
Organism:
Homo sapiens (Human)
Description:
P05181
Residue:
493
  
Inhibitor
Name:
BDBM50366379
Synonyms:
CHEMBL4165249
Type:
Small organic molecule
Emp. Form.:
C13H18Cl2N2S
Mol. Mass.:
305.266
SMILES:
Cl.Cl.CCCc1ccncc1-c1ccc(CN)s1
: