Target
Excitatory amino acid transporter 3
Ligand
BDBM85209
Substrate
Meas. Tech.
ChEMBL_1735432 (CHEMBL4150968)
IC50
9600±n/a nM
Citation
 Fu, HZhang, JTepper, PGBunch, LJensen, AAPoelarends, GJ Chemoenzymatic Synthesis and Pharmacological Characterization of Functionalized Aspartate Analogues As Novel Excitatory Amino Acid Transporter Inhibitors. J Med Chem 61:7741-7753 (2018)  
Target
Name:
Excitatory amino acid transporter 3
Synonyms:
EAA3_HUMAN EAAT3 HEAAC1 | SLC1A1
Type:
Enzyme Catalytic Domain
Mol. Mass.:
57096.71
Organism:
Homo sapiens (Human)
Description:
Excitatory Amino Acid EAAT3 0 HUMAN::P43005
Residue:
524
  
Inhibitor
Name:
BDBM85209
Synonyms:
DL-THA
Type:
Small organic molecule
Emp. Form.:
C4H7NO5
Mol. Mass.:
149.1021
SMILES:
N[C@@H]([C@H](O)C(O)=O)C(O)=O
: