Target
Catechol O-methyltransferase
Ligand
BDBM50017863
Substrate
Meas. Tech.
ChEBML_47065
IC50
90±n/a nM
Citation
 Bäckström, RHonkanen, EPippuri, AKairisalo, PPystynen, JHeinola, KNissinen, ELinden, IBMännistö, PTKaakkola, S Synthesis of some novel potent and selective catechol O-methyltransferase inhibitors. J Med Chem 32:841-6 (1989)  
Target
Name:
Catechol O-methyltransferase
Synonyms:
COMT_RAT Catechol-O-methyltransferase | Comt
Type:
Enzyme
Mol. Mass.:
29594.09
Organism:
Rattus norvegicus (Rat)
Description:
Residue:
264
  
Inhibitor
Name:
BDBM50017863
Synonyms:
CHEMBL167172 | N-Adamantan-1-yl-3-cyano-4,5-dihydroxy-benzamide
Type:
Small organic molecule
Emp. Form.:
C18H20N2O3
Mol. Mass.:
312.363
SMILES:
Oc1cc(cc(C#N)c1O)C(=O)NC12CC3CC(CC(C3)C1)C2
: