Target
Bromodomain-containing protein 1
Ligand
BDBM50366670
Substrate
Meas. Tech.
ChEMBL_1735493 (CHEMBL4151029)
Kd
>5000±n/a nM
Citation
 Zhao, YZhou, BBai, LLiu, LYang, CYMeagher, JLStuckey, JAMcEachern, DPrzybranowski, SWang, MRan, XAguilar, AHu, YKampf, JWLi, XZhao, TLi, SWen, BSun, DWang, S Structure-Based Discovery of CF53 as a Potent and Orally Bioavailable Bromodomain and Extra-Terminal (BET) Bromodomain Inhibitor. J Med Chem 61:6110-6120 (2018)  
Target
Name:
Bromodomain-containing protein 1
Synonyms:
BR140-like protein BRD1_HUMAN BRL Bromodomain and PHD finger-containing protein 2 | Bromodomain-containing protein 1
Type:
PROTEIN
Mol. Mass.:
119557.65
Organism:
Homo sapiens (Human)
Description:
ChEMBL_105349
Residue:
1058
  
Inhibitor
Name:
BDBM50366670
Synonyms:
CHEMBL4173488
Type:
Small organic molecule
Emp. Form.:
C24H25N7O2
Mol. Mass.:
443.501
SMILES:
COc1cc2c(cc1-c1c(C)noc1C)[nH]c1nc(C)nc(Nc3cc(nn3C)C3CC3)c21
: