Target
Melanocortin receptor 5
Ligand
BDBM50017181
Substrate
Meas. Tech.
ChEMBL_1735867 (CHEMBL4151403)
EC50
0.140000±n/a nM
Citation
 Fleming, KAFreeman, KTEricson, MDHaskell-Luevano, C Synergistic Multiresidue Substitutions of a Macrocyclic c[Pro-Arg-Phe-Phe-Asn-Ala-Phe-dPro] Agouti-Related Protein (AGRP) Scaffold Yield Potent and >600-Fold MC4R versus MC3R Selective Melanocortin Receptor Antagonists. J Med Chem 61:7729-7740 (2018)  
Target
Name:
Melanocortin receptor 5
Synonyms:
MC5R_MOUSE Melanocortin receptor 5 | Melanocortin receptor 5 (MC5R)
Type:
Enzyme
Mol. Mass.:
36966.58
Organism:
Mus musculus (Mouse)
Description:
P41149
Residue:
325
  
Inhibitor
Name:
BDBM50017181
Synonyms:
CHEMBL441738
Type:
Small organic molecule
Emp. Form.:
C78H111N21O19
Mol. Mass.:
1646.8452
SMILES:
CCCC[C@H](NC(=O)[C@H](CO)NC(=O)[C@H](Cc1ccc(O)cc1)NC(=O)[C@H](CO)NC(C)=O)C(=O)N[C@@H](CCC(O)=O)C(=O)N[C@@H](Cc1cnc[nH]1)C(=O)N[C@H](Cc1ccccc1)C(=O)N[C@@H](CCCNC(N)=N)C(=O)N[C@@H](Cc1c[nH]c2ccccc12)C(=O)NCC(=O)N[C@@H](CCCCN)C(=O)N1CCC[C@H]1C(=O)N[C@@H](C(C)C)C(N)=O
: