Target
Gastrin/cholecystokinin type B receptor
Ligand
BDBM50018060
Substrate
Meas. Tech.
ChEBML_75663
Ki
0.560000±n/a nM
Citation
 Charpentier, BDor, ARoy, PEngland, PPham, HDurieux, CRoques, BP Synthesis and binding affinities of cyclic and related linear analogues of CCK8 selective for central receptors. J Med Chem 32:1184-90 (1989)  
Target
Name:
Gastrin/cholecystokinin type B receptor
Synonyms:
CCK-2 receptor CCK-BR CCKRB Cholecystokinin receptor GASR_HUMAN | Gastrin/cholecystokinin type B receptor
Type:
G Protein-Coupled Receptor (GPCR)
Mol. Mass.:
48445.79
Organism:
Homo sapiens (Human)
Description:
Stable expression of human CCK-2 receptors in HEK 293 cells.
Residue:
447
  
Inhibitor
Name:
BDBM50018060
Synonyms:
Boc-cyclo-(gama-D-Glu-Tyr(SO3H)-Nle-D-Lys)-Trp-Nle-Asp-Phe-NH2 | CHEMBL264273
Type:
Small organic molecule
Emp. Form.:
C61H83N11O17S
Mol. Mass.:
1274.44
SMILES:
CCCC[C@H](NC(=O)[C@H](Cc1c[nH]c2ccccc12)NC(=O)[C@@H]1CCCCNC(=O)[C@@H](CCC(=O)N[C@H](Cc2ccc(OS(O)(=O)=O)cc2)C(=O)N[C@@H](CCCC)C(=O)N1)NC(=O)OC(C)(C)C)C(=O)N[C@@H](CC(O)=O)C(=O)N[C@H](Cc1ccccc1)C(N)=O
: