Target
ALK tyrosine kinase receptor
Ligand
BDBM50369714
Substrate
Meas. Tech.
ChEMBL_1737080 (CHEMBL4152830)
Kd
54±n/a nM
Citation
 Zhang, CHan, XRYang, XJiang, BLiu, JXiong, YJin, J Proteolysis Targeting Chimeras (PROTACs) of Anaplastic Lymphoma Kinase (ALK). Eur J Med Chem 151:304-314 (2018)  
Target
Name:
ALK tyrosine kinase receptor
Synonyms:
ALK ALK_HUMAN CD_antigen: CD246
Type:
Protein
Mol. Mass.:
176453.10
Organism:
Homo sapiens (Human)
Description:
Q9UM73
Residue:
1620
  
Inhibitor
Name:
BDBM50369714
Synonyms:
CHEMBL4159122
Type:
Small organic molecule
Emp. Form.:
C56H74ClN9O13S
Mol. Mass.:
1148.757
SMILES:
CC(C)Oc1cc(C2CCN(CC(=O)NCCOCCOCCOCCOCCOCCNc3cccc4C(=O)N(C5CCC(=O)N(C)C5=O)C(=O)c34)CC2)c(C)cc1Nc1ncc(Cl)c(Nc2ccccc2S(=O)(=O)C(C)C)n1
: