Target
Heat shock protein HSP 90-alpha
Ligand
BDBM50005782
Substrate
Meas. Tech.
ChEMBL_1738230 (CHEMBL4153980)
IC50
14±n/a nM
Citation
 Geng, KLiu, HSong, ZZhang, CZhang, MYang, HCao, JGeng, MShen, AZhang, A Design, synthesis and pharmacological evaluation of ALK and Hsp90 dual inhibitors bearing resorcinol and 2,4-diaminopyrimidine motifs. Eur J Med Chem 152:76-86 (2018)  
Target
Name:
Heat shock protein HSP 90-alpha
Synonyms:
HS90A_HUMAN HSP86 HSP90AA1 HSPCA Heat shock 86 kDa Heat shock protein HSP 90-alpha (HSP90) LAP-2 Lipopolysaccharide-associated protein 2 heat shock protein 90kDa alpha (cytosolic), class A member 1 isoform 2
Type:
Molecular Chaperone
Mol. Mass.:
84623.45
Organism:
Homo sapiens (Human)
Description:
P07900
Residue:
732
  
Inhibitor
Name:
BDBM50005782
Synonyms:
ATI-13387X | ONALESPIB
Type:
Small organic molecule
Emp. Form.:
C24H31N3O3
Mol. Mass.:
409.5212
SMILES:
CC(C)c1cc(C(=O)N2Cc3ccc(CN4CCN(C)CC4)cc3C2)c(O)cc1O
: