Target
Transient receptor potential cation channel subfamily M member 2
Ligand
BDBM50405912
Substrate
Meas. Tech.
ChEMBL_1738662 (CHEMBL4154412)
IC50
4000±n/a nM
Citation
 Zhang, HLiu, HLuo, XWang, YLiu, YJin, HLiu, ZYang, WYu, PZhang, LZhang, L Design, synthesis and biological activities of 2,3-dihydroquinazolin-4(1H)-one derivatives as TRPM2 inhibitors. Eur J Med Chem 152:235-252 (2018)  
Target
Name:
Transient receptor potential cation channel subfamily M member 2
Synonyms:
EREG1 KNP3 LTrpC-2 TRPC7 TRPM2_HUMAN | Transient receptor potential channel 7
Type:
PROTEIN
Mol. Mass.:
171218.39
Organism:
Homo sapiens (Human)
Description:
ChEMBL_103516
Residue:
1503
  
Inhibitor
Name:
BDBM50405912
Synonyms:
CHEMBL4159037
Type:
Small organic molecule
Emp. Form.:
C22H17ClN4O
Mol. Mass.:
388.85
SMILES:
Cc1cc(Cl)cc2C(=O)NC(Nc12)c1c[nH]nc1-c1cccc2ccccc12
: