Target
Lysophosphatidylserine lipase ABHD12
Ligand
BDBM50408223
Substrate
Meas. Tech.
ChEMBL_1739440 (CHEMBL4155190)
IC50
>10000±n/a nM
Citation
 Chicca, AArena, CBertini, SGado, FCiaglia, EAbate, MDigiacomo, MLapillo, MPoli, GBifulco, MMacchia, MTuccinardi, TGertsch, JManera, C Polypharmacological profile of 1,2-dihydro-2-oxo-pyridine-3-carboxamides in the endocannabinoid system. Eur J Med Chem 154:155-171 (2018)  
Target
Name:
Lysophosphatidylserine lipase ABHD12
Synonyms:
ABD12_HUMAN C20orf22 | Monoacylglycerol lipase ABHD12
Type:
PROTEIN
Mol. Mass.:
45111.32
Organism:
Homo sapiens (Human)
Description:
ChEMBL_1514755
Residue:
398
  
Inhibitor
Name:
BDBM50408223
Synonyms:
CHEMBL4159313
Type:
Small organic molecule
Emp. Form.:
C33H33FN2O3
Mol. Mass.:
524.6251
SMILES:
COc1ccc(cc1)-c1cn(Cc2ccc(F)cc2)c(=O)c(C(=O)NC2CCCCCC2)c1-c1ccccc1
: