Target
Adenosine receptor A1
Ligand
BDBM81971
Substrate
Meas. Tech.
ChEBML_28990
Ki
44±n/a nM
Citation
 Schneller, SWIbay, ACChrist, WJBruns, RF Linear and proximal benzo-separated alkylated xanthines as adenosine-receptor antagonists. J Med Chem 32:2247-54 (1989)  
Target
Name:
Adenosine receptor A1
Synonyms:
AA1R_RAT ADENOSINE A1 high Adenosine A1 receptor (A1) Adenosine receptors A1 | Adora1
Type:
Protein
Mol. Mass.:
36704.13
Organism:
Rattus norvegicus (rat)
Description:
Residue:
326
  
Inhibitor
Name:
BDBM81971
Synonyms:
1,3-Diethyl-8-phenyl-3,7-dihydro-purine-2,6-dione CHEMBL11348 NSC_1328
Type:
Small organic molecule
Emp. Form.:
C15H16N4O2
Mol. Mass.:
284.3131
SMILES:
CCn1c2nc([nH]c2c(=O)n(CC)c1=O)-c1ccccc1
: