Target
N-arachidonyl glycine receptor
Ligand
BDBM50449565
Substrate
Meas. Tech.
ChEMBL_1740200 (CHEMBL4155950)
EC50
>10000±n/a nM
Citation
 Schoeder, CTKaleta, MMahardhika, ABOlejarz-Maciej, A?a?ewska, DKie?-Kononowicz, KMüller, CE Structure-activity relationships of imidazothiazinones and analogs as antagonists of the cannabinoid-activated orphan G protein-coupled receptor GPR18. Eur J Med Chem 155:381-397 (2018)  
Target
Name:
N-arachidonyl glycine receptor
Synonyms:
G-protein coupled receptor 18 GPR18 NAGly receptor
Type:
PROTEIN
Mol. Mass.:
38150.44
Organism:
Homo sapiens (Human)
Description:
ChEMBL_107601
Residue:
331
  
Inhibitor
Name:
BDBM50449565
Synonyms:
CHEMBL4177155
Type:
Small organic molecule
Emp. Form.:
C25H21ClN2O2S
Mol. Mass.:
448.964
SMILES:
Clc1ccc(COc2cccc(\C=C3/N=C(NC3=O)SCCc3ccccc3)c2)cc1
: