Target
Carbonic anhydrase 5B, mitochondrial
Ligand
BDBM50449833
Substrate
Meas. Tech.
ChEMBL_1740748 (CHEMBL4156498)
Kd
12500±n/a nM
Citation
 Zak?auskas, A?apkauskait?, EJezep?ikas, LLinkuvien?, VKi?onait?, MSmirnov, AManakova, EGra?ulis, SMatulis, D Design of two-tail compounds with rotationally fixed benzenesulfonamide ring as inhibitors of carbonic anhydrases. Eur J Med Chem 156:61-78 (2018)  
Target
Name:
Carbonic anhydrase 5B, mitochondrial
Synonyms:
CA-VB CAH5B_HUMAN Carbonic Anhydrase VB Carbonic anhydrase 5B, mitochondrial Carbonic anhydrase V | Carbonic anhydrase VB (CA VB)
Type:
Enzyme
Mol. Mass.:
36440.83
Organism:
Homo sapiens (Human)
Description:
Human (cloned) isozyme
Residue:
317
  
Inhibitor
Name:
BDBM50449833
Synonyms:
CHEMBL4162451
Type:
Small organic molecule
Emp. Form.:
C16H24ClN3O4S
Mol. Mass.:
389.897
SMILES:
COCCNC(=O)c1cc(c(Cl)cc1NC1CCCCC1)S(N)(=O)=O
: