Target
Carbonic anhydrase 12
Ligand
BDBM50449835
Substrate
Meas. Tech.
ChEMBL_1740767 (CHEMBL4156517)
Kd
0.077000±n/a nM
Citation
 Zak?auskas, A?apkauskait?, EJezep?ikas, LLinkuvien?, VKi?onait?, MSmirnov, AManakova, EGra?ulis, SMatulis, D Design of two-tail compounds with rotationally fixed benzenesulfonamide ring as inhibitors of carbonic anhydrases. Eur J Med Chem 156:61-78 (2018)  
Target
Name:
Carbonic anhydrase 12
Synonyms:
CA-XII CAH12_HUMAN Carbonic anhydrase Carbonic anhydrase XII Carbonic anhydrase XII (CAXII) | Tumor antigen HOM-RCC-3.1.3
Type:
Enzyme
Mol. Mass.:
39456.00
Organism:
Homo sapiens (Human)
Description:
Catalytic domain of human cloned isozyme was used in the assay
Residue:
354
  
Inhibitor
Name:
BDBM50449835
Synonyms:
CHEMBL4170371
Type:
Small organic molecule
Emp. Form.:
C17H20ClN3O4S
Mol. Mass.:
397.876
SMILES:
COCCNC(=O)c1cc(c(Cl)cc1NCc1ccccc1)S(N)(=O)=O
: