Target
Carbonic anhydrase 14
Ligand
BDBM50449832
Substrate
Meas. Tech.
ChEMBL_1740769 (CHEMBL4156519)
Kd
0.047000±n/a nM
Citation
 Zak?auskas, A?apkauskait?, EJezep?ikas, LLinkuvien?, VKi?onait?, MSmirnov, AManakova, EGra?ulis, SMatulis, D Design of two-tail compounds with rotationally fixed benzenesulfonamide ring as inhibitors of carbonic anhydrases. Eur J Med Chem 156:61-78 (2018)  
Target
Name:
Carbonic anhydrase 14
Synonyms:
CA-XIV CAH14_HUMAN Carbonic Anhydrase XIV Carbonic anhydrase 14 Carbonic anhydrase XIV (CA XIV)
Type:
Enzyme
Mol. Mass.:
37665.67
Organism:
Homo sapiens (Human)
Description:
Human (cloned) isozyme.
Residue:
337
  
Inhibitor
Name:
BDBM50449832
Synonyms:
CHEMBL4165543
Type:
Small organic molecule
Emp. Form.:
C16H24ClN3O4S
Mol. Mass.:
389.897
SMILES:
NS(=O)(=O)c1cc(C(=O)NCCCO)c(NC2CCCCC2)cc1Cl
: