Target
Carbonic anhydrase 9
Ligand
BDBM50449828
Substrate
Meas. Tech.
ChEMBL_1740766 (CHEMBL4156516)
Kd
0.011000±n/a nM
Citation
 Zak?auskas, A?apkauskait?, EJezep?ikas, LLinkuvien?, VKi?onait?, MSmirnov, AManakova, EGra?ulis, SMatulis, D Design of two-tail compounds with rotationally fixed benzenesulfonamide ring as inhibitors of carbonic anhydrases. Eur J Med Chem 156:61-78 (2018)  
Target
Name:
Carbonic anhydrase 9
Synonyms:
CA-IX CAH9_HUMAN Carbonic anhydrase 9 (CA IX) Carbonic anhydrase 9 precursor Carbonic anhydrase IX (CAIX) Carbonic anhydrases; II & IX MN RCC-associated antigen G250
Type:
Enzyme
Mol. Mass.:
49669.03
Organism:
Homo sapiens (Human)
Description:
Catalytic domain of human cloned isozyme was used in the assay
Residue:
459
  
Inhibitor
Name:
BDBM50449828
Synonyms:
CHEMBL4174214
Type:
Small organic molecule
Emp. Form.:
C17H26ClN3O3S
Mol. Mass.:
387.925
SMILES:
CCCCNC(=O)c1cc(c(Cl)cc1NC1CCCCC1)S(N)(=O)=O
: