Target
Carbonic anhydrase 5B, mitochondrial
Ligand
BDBM50449830
Substrate
Meas. Tech.
ChEMBL_1740763 (CHEMBL4156513)
Kd
35±n/a nM
Citation
 Zak?auskas, A?apkauskait?, EJezep?ikas, LLinkuvien?, VKi?onait?, MSmirnov, AManakova, EGra?ulis, SMatulis, D Design of two-tail compounds with rotationally fixed benzenesulfonamide ring as inhibitors of carbonic anhydrases. Eur J Med Chem 156:61-78 (2018)  
Target
Name:
Carbonic anhydrase 5B, mitochondrial
Synonyms:
CA-VB CAH5B_HUMAN Carbonic Anhydrase VB Carbonic anhydrase 5B, mitochondrial Carbonic anhydrase V | Carbonic anhydrase VB (CA VB)
Type:
Enzyme
Mol. Mass.:
36440.83
Organism:
Homo sapiens (Human)
Description:
Human (cloned) isozyme
Residue:
317
  
Inhibitor
Name:
BDBM50449830
Synonyms:
CHEMBL4173814
Type:
Small organic molecule
Emp. Form.:
C11H12Cl2N2O4S
Mol. Mass.:
339.195
SMILES:
NS(=O)(=O)c1cc(C(=O)N2CCOCC2)c(Cl)cc1Cl
: