Target
Carbonic anhydrase 5B, mitochondrial
Ligand
BDBM50449810
Substrate
Meas. Tech.
ChEMBL_1740763 (CHEMBL4156513)
Kd
6.1±n/a nM
Citation
 Zak?auskas, A?apkauskait?, EJezep?ikas, LLinkuvien?, VKi?onait?, MSmirnov, AManakova, EGra?ulis, SMatulis, D Design of two-tail compounds with rotationally fixed benzenesulfonamide ring as inhibitors of carbonic anhydrases. Eur J Med Chem 156:61-78 (2018)  
Target
Name:
Carbonic anhydrase 5B, mitochondrial
Synonyms:
CA-VB CAH5B_HUMAN Carbonic Anhydrase VB Carbonic anhydrase 5B, mitochondrial Carbonic anhydrase V | Carbonic anhydrase VB (CA VB)
Type:
Enzyme
Mol. Mass.:
36440.83
Organism:
Homo sapiens (Human)
Description:
Human (cloned) isozyme
Residue:
317
  
Inhibitor
Name:
BDBM50449810
Synonyms:
CHEMBL4162133
Type:
Small organic molecule
Emp. Form.:
C12H14Cl2N2O5S
Mol. Mass.:
369.221
SMILES:
CC(=O)OCCCNC(=O)c1cc(c(Cl)cc1Cl)S(N)(=O)=O
: