Target
Carbonic anhydrase 4
Ligand
BDBM50449811
Substrate
Meas. Tech.
ChEMBL_1740761 (CHEMBL4156511)
Kd
1.7±n/a nM
Citation
 Zak?auskas, A?apkauskait?, EJezep?ikas, LLinkuvien?, VKi?onait?, MSmirnov, AManakova, EGra?ulis, SMatulis, D Design of two-tail compounds with rotationally fixed benzenesulfonamide ring as inhibitors of carbonic anhydrases. Eur J Med Chem 156:61-78 (2018)  
Target
Name:
Carbonic anhydrase 4
Synonyms:
CA-IV CAH4_HUMAN Carbonic anhydrase Carbonic anhydrase IV (CA IV)
Type:
Enzyme
Mol. Mass.:
35037.98
Organism:
Homo sapiens (Human)
Description:
P22748
Residue:
312
  
Inhibitor
Name:
BDBM50449811
Synonyms:
CHEMBL4165127
Type:
Small organic molecule
Emp. Form.:
C7H5Br2NO4S
Mol. Mass.:
358.992
SMILES:
NS(=O)(=O)c1cc(C(O)=O)c(Br)cc1Br
: