Target
Gag-Pol polyprotein
Ligand
BDBM50450015
Substrate
Meas. Tech.
ChEMBL_1741650 (CHEMBL4157400)
Kd
6.5±n/a nM
Citation
 Regueiro-Ren, ASwidorski, JJLiu, ZChen, YSin, NSit, SYChen, JVenables, BLZhu, JNowicka-Sans, BProtack, TLin, ZTerry, BSamanta, HZhang, SLi, ZEaster, JBeno, BRArora, VHuang, XSRahematpura, SParker, DDHaskell, RSantone, KSCockett, MIKrystal, MMeanwell, NAJenkins, SHanumegowda, UDicker, IB Design, Synthesis, and SAR of C-3 Benzoic Acid, C-17 Triterpenoid Derivatives. Identification of the HIV-1 Maturation Inhibitor 4-((1 R,3a S,5a R,5b R,7a R,11a S,11b R,13a R,13b R)-3a-((2-(1,1-Dioxidothiomorpholino)ethyl)amino)-5a,5b,8,8,11a-pentamethyl-1-(prop-1-en-2-yl)-2,3,3a,4,5,5a,5b,6,7,7a,8,1 J Med Chem 61:7289-7313 (2018)  
Target
Name:
Gag-Pol polyprotein
Synonyms:
HIV-1 reverse transcriptase (HIV-1 RT) POL_HV1H2 Protease Reverse transcriptase (RT) gag-pol p66 RT
Type:
Protein
Mol. Mass.:
162074.74
Organism:
Human immunodeficiency virus type 1 group M subtype B (isolate HXB2)
Description:
P04585
Residue:
1435
  
Inhibitor
Name:
BDBM50450015
Synonyms:
Bms-955176 | GSK-3532795
Type:
Small organic molecule
Emp. Form.:
C42H62N2O4S
Mol. Mass.:
691.018
SMILES:
[H][C@]12[C@@H](CC[C@@]1(CC[C@]1(C)[C@]2([H])CC[C@]2([H])[C@@]3(C)CC=C(c4ccc(cc4)C(O)=O)C(C)(C)[C@]3([H])CC[C@@]12C)NCCN1CCS(=O)(=O)CC1)C(C)=C
: