Target
E3 ubiquitin-protein ligase XIAP
Ligand
BDBM50450047
Substrate
Meas. Tech.
ChEMBL_1741810 (CHEMBL4157560)
IC50
0.830000±n/a nM
Citation
 Johnson, CNAhn, JSBuck, IMChiarparin, EDay, JEHHopkins, AHoward, SLewis, EJMartins, VMillemaggi, AMunck, JMPage, LWPeakman, TReader, MRich, SJSaxty, GSmyth, TThompson, NTWard, GAWilliams, PAWilsher, NEChessari, G A Fragment-Derived Clinical Candidate for Antagonism of X-Linked and Cellular Inhibitor of Apoptosis Proteins: 1-(6-[(4-Fluorophenyl)methyl]-5-(hydroxymethyl)-3,3-dimethyl-1 H,2 H,3 H-pyrrolo[3,2- b]pyridin-1-yl)-2-[(2 R,5 R)-5-methyl-2-([(3R)-3-methylmorpholin-4-yl]methyl)piperazin-1-yl]ethan-1-one J Med Chem 61:7314-7329 (2018)  
Target
Name:
E3 ubiquitin-protein ligase XIAP
Synonyms:
API3 E3 ubiquitin-protein ligase XIAP Inhibitor of apoptosis protein 3 X-linked inhibitor of apoptosis XIAP | XIAP_HUMAN
Type:
Protein
Mol. Mass.:
56685.27
Organism:
Homo sapiens (Human)
Description:
P98170
Residue:
497
  
Inhibitor
Name:
BDBM50450047
Synonyms:
CHEMBL4169478
Type:
Small organic molecule
Emp. Form.:
C31H44FN5O3
Mol. Mass.:
553.7112
SMILES:
C[C@@H]1CN(CC(=O)N2CC(C)(C)c3c2cc(Cc2ccc(F)cc2)c(=O)n3C)[C@@H](CN2[C@H](C)COC[C@H]2C)CN1
: