Target
Peroxisome proliferator-activated receptor gamma
Ligand
BDBM50450130
Substrate
Meas. Tech.
ChEMBL_1742220 (CHEMBL4157970)
EC50
68±n/a nM
Citation
 Shinozuka, TTsukada, TFujii, KTokumaru, EShimada, KOnishi, YMatsui, YWakimoto, SKuroha, MOgata, TAraki, KOhsumi, JSawamura, RWatanabe, NYamamoto, HFujimoto, KTani, YMori, MTanaka, J Discovery of DS-6930, a potent selective PPAR? modulator. Part II: Lead optimization. Bioorg Med Chem 26:5099-5117 (2018)  
Target
Name:
Peroxisome proliferator-activated receptor gamma
Synonyms:
NR1C3 PPAR-gamma PPARG_HUMAN Peroxisome proliferator-activated receptor gamma (PPAR gamma) Peroxisome proliferator-activated receptor gamma (PPARĪ³) peroxisome proliferator-activated receptor gamma isoform 2
Type:
Nuclear Receptor
Mol. Mass.:
57613.46
Organism:
Homo sapiens (Human)
Description:
P37231
Residue:
505
  
Inhibitor
Name:
BDBM50450130
Synonyms:
CHEMBL4164753
Type:
Small organic molecule
Emp. Form.:
C22H16ClFN2O4
Mol. Mass.:
426.825
SMILES:
Cn1c(COc2cccc(c2)C(O)=O)nc2ccc(Oc3ccc(Cl)c(F)c3)cc12
: