Target
Signal transducer and activator of transcription 3
Ligand
BDBM50450176
Substrate
Meas. Tech.
ChEMBL_1742299 (CHEMBL4158049)
EC50
4430±n/a nM
Citation
 Chen, SRLi, FDing, MYWang, DZhao, QWang, YZhou, GCWang, Y Andrographolide derivative as STAT3 inhibitor that protects acute liver damage in mice. Bioorg Med Chem 26:5053-5061 (2018)  
Target
Name:
Signal transducer and activator of transcription 3
Synonyms:
APRF STAT3_HUMAN Signal transducer and activator of transcription 3 (STAT3)
Type:
Protein
Mol. Mass.:
88064.31
Organism:
Homo sapiens (Human)
Description:
P40763
Residue:
770
  
Inhibitor
Name:
BDBM50450176
Synonyms:
CHEMBL4168778
Type:
Small organic molecule
Emp. Form.:
C28H44O6Si
Mol. Mass.:
504.7309
SMILES:
[H][C@]12[#6]-[#6]-[#6](=[#6])-[#6@@H](-[#6]\[#6]=[#6]-3/[#6@@H](-[#6]-[#8]-[#6]-3=O)-[#8]-[#6](-[#6])=O)[C@]1([#6])[#6]-[#6]-[#6](=O)[C@@]2([#6])[#6]-[#8][Si;v4]([#6])([#6])C([#6])([#6])[#6]
: