Target
Sigma non-opioid intracellular receptor 1
Ligand
BDBM50048866
Substrate
Meas. Tech.
ChEMBL_1743019 (CHEMBL4158769)
Ki
0.380000±n/a nM
Citation
 Bergkemper, MKronenberg, EThum, SBörgel, FDaniliuc, CSchepmann, DNieto, FRBrust, PReinoso, RFAlvarez, IWünsch, B Synthesis, Receptor Affinity, and Antiallodynic Activity of Spirocyclic ? Receptor Ligands with Exocyclic Amino Moiety. J Med Chem 61:9666-9690 (2018)  
Target
Name:
Sigma non-opioid intracellular receptor 1
Synonyms:
OPRS1 SIGMAR1 Sigma non-opioid intracellular receptor 1 Sigma1-receptor Sterol isomerase-like protein
Type:
Protein
Mol. Mass.:
25307.17
Organism:
Cavia porcellus (Guinea pig)
Description:
Q60492
Residue:
223
  
Inhibitor
Name:
BDBM50048866
Synonyms:
1-Cyclohexyl-4-[3-(5-methoxy-1,2,3,4-tetrahydro-naphthalen-1-yl)-propyl]-piperazine 1-cyclohexyl-4-[3-(5-methoxy-1,2,3,4-tetrahydro-naphthalen-1-yl)propyl]piperazine CHEMBL53325 | PB-28
Type:
Small organic molecule
Emp. Form.:
C24H38N2O
Mol. Mass.:
370.5713
SMILES:
COc1cccc2C(CCCN3CCN(CC3)C3CCCCC3)CCCc12
: