Target
Potassium-transporting ATPase alpha chain 1/subunit beta
Ligand
BDBM50018879
Substrate
Meas. Tech.
ChEMBL_75905 (CHEMBL689040)
IC50
>100000±n/a nM
Citation
 Adelstein, GWYen, CHHaack, RAYu, SGullikson, GPrice, DVAnglin, CDecktor, DLTsai, HKeith, RH Substituted 2-[(2-benzimidazolylsulfinyl)methyl]anilines as potential inhibitors of H+/K+ ATPase. J Med Chem 31:1215-20 (1988)  
Target
Name:
Potassium-transporting ATPase alpha chain 1/subunit beta
Synonyms:
Potassium-transporting ATPase | Potassium-transporting ATPase alpha chain 1/beta chain
Type:
Mol. Mass.:
Description:
ASSAY_ID of EBI is 71495
Components:
This complex has 2 components.
Component 1
Name:
Potassium-transporting ATPase alpha chain 1
Synonyms:
ATP4A Gastric H(+)/K(+) ATPase subunit alpha Potassium-transporting ATPase alpha chain 1 | Proton pump
Type:
PROTEIN
Mol. Mass.:
114109.05
Organism:
Homo sapiens (Human)
Description:
EBI_82
Residue:
1035
  
Component 2
Name:
Potassium-transporting ATPase subunit beta
Synonyms:
ATP4B Gastric H(+)/K(+) ATPase subunit beta Potassium-transporting ATPase subunit beta | Proton pump beta chain
Type:
PROTEIN
Mol. Mass.:
33369.83
Organism:
Homo sapiens (Human)
Description:
EBI_10719
Residue:
291
  
Inhibitor
Name:
BDBM50018879
Synonyms:
4-Amino-3-(1H-benzoimidazole-2-sulfinylmethyl)-benzoic acid ethyl ester | CHEMBL19992
Type:
Small organic molecule
Emp. Form.:
C17H17N3O3S
Mol. Mass.:
343.4
SMILES:
CCOC(=O)c1ccc(N)c(CS(=O)c2nc3ccccc3[nH]2)c1
: