Target
Tyrosine-protein kinase BTK
Ligand
BDBM202105
Substrate
Meas. Tech.
ChEMBL_1743735 (CHEMBL4178245)
IC50
36±n/a nM
Citation
 Thakkar, MBhuniya, DKaduskar, RMengawade, TNaik, KSalunkhe, VBhalerao, AKurhade, SMavinahalli, JJain, VPetla, RAvaragolla, SRay, SRouduri, SDhanave, ADe, SPathade, VTambe, ARaje, AAMadgula, VJoshi, SNadeem, ABala, MUmrani, DHariharan, NKulkarni, BMookhtiar, KA Discovery and evaluation of 1H-pyrrolo[2,3-b]pyridine based selective and reversible small molecule BTK inhibitors for the treatment of rheumatoid arthritis. Bioorg Med Chem Lett 27:1867-1873 (2017)  
Target
Name:
Tyrosine-protein kinase BTK
Synonyms:
ATK B-cell progenitor kinase Bpk Btk | Kinase EMB
Type:
PROTEIN
Mol. Mass.:
76447.19
Organism:
Mus musculus
Description:
ChEMBL_108319
Residue:
659
  
Inhibitor
Name:
BDBM202105
Synonyms:
US9233983, C-2
Type:
Small organic molecule
Emp. Form.:
C36H36N6O3
Mol. Mass.:
600.7094
SMILES:
CN1CCN(CC1)c1ccc(cc1)-c1cc2c(ncnc2[nH]1)-c1cccc(N2CCOc3cc(ccc3C2=O)C2CC2)c1CO
: