Target
Glutamate receptor ionotropic, NMDA 2C
Ligand
BDBM50018932
Substrate
Meas. Tech.
ChEBML_154849
Ki
820.0±n/a nM
Citation
 Thurkauf, AHillery, PMattson, MVJacobson, AERice, KC Synthesis, pharmacological action, and receptor binding affinity of the enantiomeric 1-(1-phenyl-3-methylcyclohexyl)piperidines. J Med Chem 31:1625-8 (1988)  
Target
Name:
Glutamate receptor ionotropic, NMDA 2C
Synonyms:
Glutamate NMDA receptor; Grin1/Grin2c Grin2c NMDE3_RAT
Type:
Protein
Mol. Mass.:
135305.94
Organism:
Rattus norvegicus (Rat)
Description:
Q00961
Residue:
1237
  
Inhibitor
Name:
BDBM50018932
Synonyms:
1-(3-Methyl-1-phenyl-cyclohexyl)-piperidine | CHEMBL40424
Type:
Small organic molecule
Emp. Form.:
C18H27N
Mol. Mass.:
257.4137
SMILES:
C[C@@H]1CCC[C@@](C1)(N1CCCCC1)c1ccccc1
: