Target
Beta-lactamase 1
Ligand
BDBM50450975
Substrate
Meas. Tech.
ChEMBL_1744439 (CHEMBL4178949)
Ki
1.3±n/a nM
Citation
 González-Bello, C Antibiotic adjuvants - A strategy to unlock bacterial resistance to antibiotics. Bioorg Med Chem Lett 27:4221-4228 (2017)  
Target
Name:
Beta-lactamase 1
Synonyms:
3.5.2.6 Beta-lactamase penPC
Type:
PROTEIN
Mol. Mass.:
33602.48
Organism:
Bacillus cereus
Description:
ChEMBL_117771
Residue:
306
  
Inhibitor
Name:
BDBM50450975
Synonyms:
CHEMBL4204887
Type:
Small organic molecule
Emp. Form.:
C10H12BNO7S
Mol. Mass.:
301.081
SMILES:
OB(O)CNC(=O)S(=O)(=O)Cc1cccc(c1)C(O)=O
: