Target
JAK3/JAK1
Ligand
BDBM153159
Substrate
Meas. Tech.
ChEMBL_1744518 (CHEMBL4179028)
IC50
280±n/a nM
Citation
 Forster, MGehringer, MLaufer, SA Recent advances in JAK3 inhibition: Isoform selectivity by covalent cysteine targeting. Bioorg Med Chem Lett 27:4229-4237 (2017)  
Target
Name:
JAK3/JAK1
Synonyms:
Tyrosine-protein kinase JAK1/JAK3
Type:
Mol. Mass.:
Description:
ASSAY_ID of ChEMBL is 2193386
Components:
This complex has 2 components.
Component 1
Name:
Tyrosine-protein kinase JAK3
Synonyms:
JAK-3 JAK3_HUMAN Janus kinase 3 (JAK3) L-JAK | Leukocyte janus kinase
Type:
Protein
Mol. Mass.:
125111.08
Organism:
Homo sapiens (Human)
Description:
P52333
Residue:
1124
  
Component 2
Name:
Tyrosine-protein kinase JAK1
Synonyms:
JAK-1 JAK1A JAK1_HUMAN Janus kinase 1 (JAK1) | Janus kinase 1 JAK1
Type:
Protein
Mol. Mass.:
133293.73
Organism:
Homo sapiens (Human)
Description:
P23458
Residue:
1154
  
Inhibitor
Name:
BDBM153159
Synonyms:
BDBM153160 | US8993756, 4-1
Type:
Small organic molecule
Emp. Form.:
C19H18N4O3
Mol. Mass.:
350.3712
SMILES:
CCOC(=O)c1c[nH]c2ncnc(-c3cccc(NC(=O)C(C)=C)c3)c12
: