Target
Neuropeptide Y receptor type 2
Ligand
BDBM50451000
Substrate
Meas. Tech.
ChEMBL_1744523 (CHEMBL4179033)
EC50
0.590000±n/a nM
Citation
 Nishizawa, NNiida, AAdachi, YKanematsu-Yamaki, YMasuda, YKumano, SYokoyama, KNoguchi, YAsakawa, THirabayashi, HAmano, NTakekawa, SOhtaki, TAsami, T Highly potent antiobesity effect of a short-length peptide YY analog in mice. Bioorg Med Chem 25:5718-5725 (2017)  
Target
Name:
Neuropeptide Y receptor type 2
Synonyms:
NPY-Y2 NPY2-R NPY2R_HUMAN Y2 receptor | neuropeptide Y receptor Y2
Type:
Enzyme Catalytic Domain
Mol. Mass.:
42734.65
Organism:
Homo sapiens (Human)
Description:
NPY-Y2 NPY2R HUMAN::P49146
Residue:
381
  
Inhibitor
Name:
BDBM50451000
Synonyms:
CHEMBL4203253
Type:
Small organic molecule
Emp. Form.:
C84H144N28O20
Mol. Mass.:
1866.2178
SMILES:
CC(C)C[C@H](NC(=O)[C@H](CC(N)=O)NC(=O)[C@H](CC1CCCCC1)NC(=O)[C@H](CC1CCCCC1)NC(=O)[C@H](Cc1cnc[nH]1)NC(=O)[C@H](CCCNC(N)=N)NC(=O)[C@H]1CCCN1C(=O)[C@H](CO)NC(=O)CO)C(=O)NC(C)(C)C(=O)N[C@@H]([C@@H](C)O)C(=O)N[C@@H](CCCNC(N)=N)C(=O)N[C@@H](CCC(N)=O)C(=O)N[C@@H](CCCNC(N)=N)C(=O)N[C@@H](CC1CCCCC1)C(N)=O
: