Target
Potassium voltage-gated channel subfamily H member 2
Ligand
BDBM50451603
Substrate
Meas. Tech.
ChEMBL_1745714 (CHEMBL4180224)
IC50
3.3±n/a nM
Citation
 Tian, JVandermosten, LPeigneur, SMoreels, LRozenski, JTytgat, JHerdewijn, PVan den Steen, PEDe Jonghe, S Astemizole analogues with reduced hERG inhibition as potent antimalarial compounds. Bioorg Med Chem 25:6332-6344 (2017)  
Target
Name:
Potassium voltage-gated channel subfamily H member 2
Synonyms:
1,3-beta-glucan synthase component GLS2 ERG Eag-related protein 1 Ether-a-go-go-related gene (HERG) Ether-a-go-go-related gene potassium channel 1 Ether-a-go-go-related gene potassium channel 1 (hERG1) Ether-a-go-go-related protein 1 H-ERG KCNH2 Potassium voltage-gated channel subfamily H member 2 (hERG) Voltage-gated potassium channel subunit Kv11.1 hERG Potassium Channel 1 | putative potassium channel subunit
Type:
Multi-pass membrane protein
Mol. Mass.:
126672.65
Organism:
Homo sapiens (Human)
Description:
Q12809
Residue:
1159
  
Inhibitor
Name:
BDBM50451603
Synonyms:
CHEMBL4207128
Type:
Small organic molecule
Emp. Form.:
C28H38N4O
Mol. Mass.:
446.6275
SMILES:
COc1ccc(CCN2CCC(CC2)Nc2nc3ccccc3n2CC2CCCCC2)cc1
: