Target
Beta-1 adrenergic receptor
Ligand
BDBM50019457
Substrate
Meas. Tech.
ChEBML_37535
IC50
>10000±n/a nM
Citation
 Wise, LDButler, DEDeWald, HALustgarten, DCoughenour, LLDowns, DAHeffner, TGPugsley, TA (5-Amino-1,3-dimethyl-1H-pyrazol-4-yl)(2-fluorophenyl)methanones . A series of novel potential antipsychotic agents. J Med Chem 29:1628-37 (1986)  
Target
Name:
Beta-1 adrenergic receptor
Synonyms:
ADRB1R, B1AR Adrb1 Adrenergic receptor beta Beta-1 adrenoreceptor adrenergic Beta1,2
Type:
Protein
Mol. Mass.:
50486.84
Organism:
Rattus norvegicus (Rat)
Description:
P18090
Residue:
466
  
Inhibitor
Name:
BDBM50019457
Synonyms:
2-Diethylamino-N-[4-(2-fluoro-benzoyl)-2,5-dimethyl-2H-pyrazol-3-yl]-acetamide | CHEMBL42084
Type:
Small organic molecule
Emp. Form.:
C18H23FN4O2
Mol. Mass.:
346.3992
SMILES:
CCN(CC)CC(=O)Nc1c(C(=O)c2ccccc2F)c(C)nn1C
: