Target
Focal adhesion kinase 1
Ligand
BDBM50452091
Substrate
Meas. Tech.
ChEMBL_1746882 (CHEMBL4181392)
IC50
5.0±n/a nM
Citation
 Liu, HWu, BGe, YHuang, JSong, SWang, CYao, JLiu, KLi, YLi, YMa, X Phosphamide-containing diphenylpyrimidine analogues (PA-DPPYs) as potent focal adhesion kinase (FAK) inhibitors with enhanced activity against pancreatic cancer cell lines. Bioorg Med Chem 25:6313-6321 (2017)  
Target
Name:
Focal adhesion kinase 1
Synonyms:
FADK 1 FAK1 FLT4 Focal adhesion kinase (FAK) Focal adhesion kinase 1 (FAK) Focal adhesion kinase-related nonkinase PTK2 Protein-tyrosine kinase 2 p125FAK | pp125FAK
Type:
Tyrosine-protein kinase
Mol. Mass.:
119233.17
Organism:
Homo sapiens (Human)
Description:
Q05397
Residue:
1052
  
Inhibitor
Name:
BDBM50452091
Synonyms:
CHEMBL4207007
Type:
Small organic molecule
Emp. Form.:
C23H27N6O6P
Mol. Mass.:
514.4708
SMILES:
CCOP(=O)(Cc1ccc(Nc2ncc(c(Nc3ccccc3C(=O)NC)n2)[N+]([O-])=O)cc1)OCC
: