Target
Trypsin
Ligand
BDBM50275926
Substrate
Meas. Tech.
ChEMBL_1746937 (CHEMBL4181447)
IC50
>30000±n/a nM
Citation
 Murafuji, HSakai, HGoto, MImajo, SSugawara, HMuto, T Discovery and structure-activity relationship study of 1,3,6-trisubstituted 1,4-diazepane-7-ones as novel human kallikrein 7 inhibitors. Bioorg Med Chem Lett 27:5272-5276 (2017)  
Target
Name:
Trypsin
Synonyms:
Serine protease 1/Trypsin-2/Trypsin-3
Type:
Mol. Mass.:
Description:
ASSAY_ID of ChEMBL is 2155713
Components:
This complex has 3 components.
Component 1
Name:
Serine protease 1
Synonyms:
Alpha-trypsin chain 1 Beta-trypsin PRSS1 TRP1 TRY1_HUMAN Thrombin & trypsin Trypsin I | Trypsin-1
Type:
Enzyme
Mol. Mass.:
26557.80
Organism:
Homo sapiens (Human)
Description:
P07477
Residue:
247
  
Component 2
Name:
Trypsin-2
Synonyms:
Anionic trypsinogen Serine protease 2 TRY2_HUMAN Thrombin & trypsin Trypsin II | Trypsin-2
Type:
PROTEIN
Mol. Mass.:
26479.43
Organism:
Homo sapiens (Human)
Description:
ChEMBL_41517
Residue:
247
  
Component 3
Name:
Trypsin-3
Synonyms:
Brain trypsinogen PRSS3 Serine protease 3 TRY3 TRY4 Trypsin Trypsin IV | Trypsin-3
Type:
PROTEIN
Mol. Mass.:
32532.52
Organism:
Homo sapiens (Human)
Description:
ChEMBL_216043
Residue:
304
  
Inhibitor
Name:
BDBM50275926
Synonyms:
CHEMBL4128173
Type:
Small organic molecule
Emp. Form.:
C24H29Cl2N5O5
Mol. Mass.:
538.424
SMILES:
Cl.COc1ccc(Cl)cc1C[C@@H]1CN\C(CN(CC(=O)Nc2cccc(c2)C(O)=O)C1=O)=N/N(C)C
: