Target
Delta-type opioid receptor
Ligand
BDBM50452249
Substrate
Meas. Tech.
ChEBML_146782
Ki
561±n/a nM
Citation
 Gairin, JEMazarguil, HAlvinerie, PSaint-Pierre, SMeunier, JCCros, J Synthesis and biological activities of dynorphin A analogues with opioid antagonist properties. J Med Chem 29:1913-7 (1986)  
Target
Name:
Delta-type opioid receptor
Synonyms:
Cytochrome P450 3A4 Delta opioid receptor Delta-type opioid receptor (DOR) OPRD_RAT Opioid receptor Opioid receptors; mu & delta Ror-a | Voltage-gated potassium channel
Type:
G Protein-Coupled Receptor (GPCR)
Mol. Mass.:
40465.04
Organism:
Rattus norvegicus (rat)
Description:
Competition binding assays were using CHO-K1 cell membranes expressing the opioid receptor.
Residue:
372
  
Inhibitor
Name:
BDBM50452249
Synonyms:
CHEMBL2373012
Type:
Small organic molecule
Emp. Form.:
C77H109N23O13
Mol. Mass.:
1564.8357
SMILES:
CC(C)C[C@H](NC(=O)[C@H](Cc1ccccc1)NC(=O)CNC(=O)[C@@H](Cc1c[nH]c2ccccc12)NC(=O)[C@@H](N)Cc1ccc(O)cc1)C(=O)N[C@@H](CCCN=C(N)N)C(=O)N[C@@H](CCCN=C(N)N)C(=O)N[C@H](Cc1c[nH]c2ccccc12)C(=O)N[C@@H](CCCN=C(N)N)C(=O)N1CCC[C@@H]1C(=O)N[C@@H](CCCCN)C(O)=O
: