Target
Cytochrome P450 1A2
Ligand
BDBM42528
Substrate
Meas. Tech.
ChEMBL_1747448 (CHEMBL4181958)
IC50
28±n/a nM
Citation
 Horley, NJBeresford, KJMKaduskar, SJoshi, PMcCann, GJPRuparelia, KCWilliams, ISGatchie, LSonawane, VRBharate, SBChaudhuri, B (E)-3-(3,4,5-Trimethoxyphenyl)-1-(pyridin-4-yl)prop-2-en-1-one, a heterocyclic chalcone is a potent and selective CYP1A1 inhibitor and cancer chemopreventive agent. Bioorg Med Chem Lett 27:5409-5414 (2017)  
Target
Name:
Cytochrome P450 1A2
Synonyms:
CP1A2_HUMAN CYPIA2 Cytochrome P(3)450 Cytochrome P450 1A2 (CYP1A2) Cytochrome P450-P3
Type:
Enzyme
Mol. Mass.:
58423.38
Organism:
Homo sapiens (Human)
Description:
P05177
Residue:
516
  
Inhibitor
Name:
BDBM42528
Synonyms:
(E)-3-(1-naphthalenyl)-1-pyridin-4-yl-2-propen-1-one (E)-3-naphthalen-1-yl-1-pyridin-4-yl-prop-2-en-1-one 3-(1-naphthyl)-1-(4-pyridinyl)-2-propen-1-one SMR000185081 | cid_5338258
Type:
Small organic molecule
Emp. Form.:
C18H13NO
Mol. Mass.:
259.3019
SMILES:
O=C(\C=C\c1cccc2ccccc12)c1ccncc1
: