Target
Cytochrome P450 1A2
Ligand
BDBM50452355
Substrate
Meas. Tech.
ChEMBL_1747448 (CHEMBL4181958)
IC50
200±n/a nM
Citation
 Horley, NJBeresford, KJMKaduskar, SJoshi, PMcCann, GJPRuparelia, KCWilliams, ISGatchie, LSonawane, VRBharate, SBChaudhuri, B (E)-3-(3,4,5-Trimethoxyphenyl)-1-(pyridin-4-yl)prop-2-en-1-one, a heterocyclic chalcone is a potent and selective CYP1A1 inhibitor and cancer chemopreventive agent. Bioorg Med Chem Lett 27:5409-5414 (2017)  
Target
Name:
Cytochrome P450 1A2
Synonyms:
CP1A2_HUMAN CYPIA2 Cytochrome P(3)450 Cytochrome P450 1A2 (CYP1A2) Cytochrome P450-P3
Type:
Enzyme
Mol. Mass.:
58423.38
Organism:
Homo sapiens (Human)
Description:
P05177
Residue:
516
  
Inhibitor
Name:
BDBM50452355
Synonyms:
CHEMBL2237710
Type:
Small organic molecule
Emp. Form.:
C17H17NO4
Mol. Mass.:
299.3212
SMILES:
COc1ccc(\C=C\C(=O)c2ccncc2)c(OC)c1OC
: