Target
Tyrosine-protein kinase BTK
Ligand
BDBM50452709
Substrate
Meas. Tech.
ChEMBL_1748102 (CHEMBL4182612)
IC50
0.400000±n/a nM
Citation
 Kawahata, WAsami, TIrie, TSawa, M Design and synthesis of novel pyrimidine analogs as highly selective, non-covalent BTK inhibitors. Bioorg Med Chem Lett 28:145-151 (2018)  
Target
Name:
Tyrosine-protein kinase BTK
Synonyms:
AGMX1 Agammaglobulinaemia tyrosine kinase B cell progenitor kinase BPK BTK_HUMAN Tyrosine Kinase BTK Tyrosine-protein kinase BTK (BTK)
Type:
Enzyme
Mol. Mass.:
76289.95
Organism:
Homo sapiens (Human)
Description:
Q06187
Residue:
659
  
Inhibitor
Name:
BDBM50452709
Synonyms:
CHEMBL4218643
Type:
Small organic molecule
Emp. Form.:
C34H34FN7O2
Mol. Mass.:
591.6779
SMILES:
CN1CCN(CC1)c1ccc(Nc2nc(N)cc(n2)-c2cccc(c2CO)-n2ccc3cc(cc(F)c3c2=O)C2CC2)cc1
: