Target
Tyrosine-protein kinase BTK
Ligand
BDBM50452717
Substrate
Meas. Tech.
ChEMBL_1748102 (CHEMBL4182612)
IC50
0.600000±n/a nM
Citation
 Kawahata, WAsami, TIrie, TSawa, M Design and synthesis of novel pyrimidine analogs as highly selective, non-covalent BTK inhibitors. Bioorg Med Chem Lett 28:145-151 (2018)  
Target
Name:
Tyrosine-protein kinase BTK
Synonyms:
AGMX1 Agammaglobulinaemia tyrosine kinase B cell progenitor kinase BPK BTK_HUMAN Tyrosine Kinase BTK Tyrosine-protein kinase BTK (BTK)
Type:
Enzyme
Mol. Mass.:
76289.95
Organism:
Homo sapiens (Human)
Description:
Q06187
Residue:
659
  
Inhibitor
Name:
BDBM50452717
Synonyms:
CHEMBL4214732
Type:
Small organic molecule
Emp. Form.:
C26H22FN7O2
Mol. Mass.:
483.497
SMILES:
Nc1cc(nc(Nc2cn[nH]c2)n1)-c1cccc(c1CO)-n1ccc2cc(cc(F)c2c1=O)C1CC1
: