Target
Nuclear receptor subfamily 1 group I member 2
Ligand
BDBM50452783
Substrate
Meas. Tech.
ChEMBL_1748344 (CHEMBL4182854)
EC50
25±n/a nM
Citation
 Gong, HWeinstein, DSLu, ZDuan, JJStachura, SHaque, LKarmakar, AHemagiri, HRaut, DKGupta, AKKhan, JCamac, DSack, JSPudzianowski, AWu, DRYarde, MShen, DRBorowski, VXie, JHSun, HD'Arienzo, CDabros, MGalella, MAWang, FWeigelt, CAZhao, QFoster, WSomerville, JESalter-Cid, LMBarrish, JCCarter, PHDhar, TGM Identification of bicyclic hexafluoroisopropyl alcohol sulfonamides as retinoic acid receptor-related orphan receptor gamma (ROR?/RORc) inverse agonists. Employing structure-based drug design to improve pregnane X receptor (PXR) selectivity. Bioorg Med Chem Lett 28:85-93 (2018)  
Target
Name:
Nuclear receptor subfamily 1 group I member 2
Synonyms:
NR1I2 Orphan nuclear receptor PAR1 PXR SXR nuclear receptor subfamily 1 group I member 2 isoform 1
Type:
Nuclear receptor
Mol. Mass.:
49774.77
Organism:
Homo sapiens (Human)
Description:
O75469
Residue:
434
  
Inhibitor
Name:
BDBM50452783
Synonyms:
CHEMBL4212458
Type:
Small organic molecule
Emp. Form.:
C18H14F7NO3S
Mol. Mass.:
457.362
SMILES:
OC(c1ccc2N(CCCc2c1)S(=O)(=O)c1ccc(F)cc1)(C(F)(F)F)C(F)(F)F
: