Target
3-hydroxy-3-methylglutaryl-coenzyme A reductase
Ligand
BDBM50452892
Substrate
Meas. Tech.
ChEMBL_1748714 (CHEMBL4183224)
IC50
13150±n/a nM
Citation
 Wang, KBao, LZhou, NZhang, JLiao, MZheng, ZWang, YLiu, CWang, JWang, LWang, WLiu, SLiu, H Structural Modification of Natural Product Ganomycin I Leading to Discovery of a ?-Glucosidase and HMG-CoA Reductase Dual Inhibitor Improving Obesity and Metabolic Dysfunction in Vivo. J Med Chem 61:3609-3625 (2018)  
Target
Name:
3-hydroxy-3-methylglutaryl-coenzyme A reductase
Synonyms:
3-hydroxy-3-methylglutaryl-coenzyme A reductase HMG-CoA reductase HMGR
Type:
PROTEIN
Mol. Mass.:
97149.70
Organism:
Sus scrofa
Description:
ChEMBL_109835
Residue:
885
  
Inhibitor
Name:
BDBM50452892
Synonyms:
CHEMBL4213527
Type:
Small organic molecule
Emp. Form.:
C23H30O4
Mol. Mass.:
370.4819
SMILES:
[#6]-[#8]-c1ccc(-[#8]-[#6])c(c1)-[#6@@H]-1-[#8]-[#6](=O)-[#6](-[#6]-[#6]\[#6]=[#6](/[#6])-[#6]-[#6]\[#6]=[#6](\[#6])-[#6])=[#6]-1
: