Target
D(2) dopamine receptor
Ligand
BDBM50019987
Substrate
Meas. Tech.
ChEBML_58532
IC50
>41±n/a nM
Citation
 New, JSYevich, JPTemple, DLNew, KBGross, SMSchlemmer, RFEison, MSTaylor, DPRiblet, LA Atypical antipsychotic agents: patterns of activity in a series of 3-substituted 2-pyridinyl-1-piperazine derivatives. J Med Chem 31:618-24 (1988)  
Target
Name:
D(2) dopamine receptor
Synonyms:
DOPAMINE D2 DOPAMINE D2 Short Dopamine D2 receptor Drd2
Type:
G Protein-Coupled Receptor (GPCR)
Mol. Mass.:
50931.60
Organism:
Rattus norvegicus (rat)
Description:
P61169
Residue:
444
  
Inhibitor
Name:
BDBM50019987
Synonyms:
4-{4-[4-(3-Phenyl-pyridin-2-yl)-piperazin-1-yl]-butyl}-morpholine-3,5-dione | CHEMBL347631
Type:
Small organic molecule
Emp. Form.:
C23H28N4O3
Mol. Mass.:
408.4934
SMILES:
O=C1COCC(=O)N1CCCCN1CCN(CC1)c1ncccc1-c1ccccc1
: