Target
Melanocortin receptor 5
Ligand
BDBM50453129
Substrate
Meas. Tech.
ChEMBL_1749145 (CHEMBL4183655)
EC50
2.0±n/a nM
Citation
 Merlino, FZhou, YCai, MCarotenuto, AYousif, AMBrancaccio, DDi Maro, SZappavigna, SLimatola, ANovellino, EGrieco, PHruby, VJ Development of Macrocyclic Peptidomimetics Containing Constrained ?,?-Dialkylated Amino Acids with Potent and Selective Activity at Human Melanocortin Receptors. J Med Chem 61:4263-4269 (2018)  
Target
Name:
Melanocortin receptor 5
Synonyms:
MC-2 MC5R Melanocortin MC5 Melanocortin receptor 5 | Melanocortin receptor 5 (MC5R)
Type:
Enzyme
Mol. Mass.:
36612.92
Organism:
Homo sapiens (Human)
Description:
P33032
Residue:
325
  
Inhibitor
Name:
BDBM50453129
Synonyms:
CHEMBL4216242
Type:
Small organic molecule
Emp. Form.:
C42H53N13O7
Mol. Mass.:
851.9531
SMILES:
NC(=N)NCCC[C@@H]1NC(=O)[C@@H](Cc2ccccc2)NC(=O)[C@H](Cc2c[nH]cn2)NC(=O)C2(CCC2)NC(=O)CC[C@H](NC(=O)[C@H](Cc2c[nH]c3ccccc23)NC1=O)C(N)=O
: