Target
Ectonucleotide pyrophosphatase/phosphodiesterase family member 1
Ligand
BDBM50453242
Substrate
Meas. Tech.
ChEMBL_1749378 (CHEMBL4183888)
Ki
1110±n/a nM
Citation
 Zelikman, VPelletier, JSimhaev, LSela, AGendron, FPArguin, GSenderowitz, HSévigny, JFischer, B Highly Selective and Potent Ectonucleotide Pyrophosphatase-1 (NPP1) Inhibitors Based on Uridine 5'-P J Med Chem 61:3939-3951 (2018)  
Target
Name:
Ectonucleotide pyrophosphatase/phosphodiesterase family member 1
Synonyms:
ENPP1 M6S1 PC1 | PDNP1
Type:
PROTEIN
Mol. Mass.:
104934.43
Organism:
Homo sapiens (Human)
Description:
ChEMBL_1448940
Residue:
925
  
Inhibitor
Name:
BDBM50453242
Synonyms:
CHEMBL4213959
Type:
Small organic molecule
Emp. Form.:
C10H17N2O12P3S2
Mol. Mass.:
514.299
SMILES:
O[C@H]1[C@@H](O)[C@@H](O[C@@H]1COP(S)(=S)OP(O)(=O)CP(O)(O)=O)n1ccc(=O)[nH]c1=O
: