Target
D(2) dopamine receptor
Ligand
BDBM50019960
Substrate
Meas. Tech.
ChEBML_63037
Ki
4.3±n/a nM
Citation
 van Wijngaarden, IKruse, CGvan der Heyden, JATulp, MT 2-Phenylpyrroles as conformationally restricted benzamide analogues. A new class of potential antipsychotics. 2. J Med Chem 31:1934-40 (1988)  
Target
Name:
D(2) dopamine receptor
Synonyms:
DOPAMINE D2 DOPAMINE D2 Short Dopamine D2 receptor Drd2
Type:
G Protein-Coupled Receptor (GPCR)
Mol. Mass.:
50931.60
Organism:
Rattus norvegicus (rat)
Description:
P61169
Residue:
444
  
Inhibitor
Name:
BDBM50019960
Synonyms:
4-Fluoro-N-{2-[4-(2-methoxy-phenyl)-piperazin-1-yl]-ethyl}-benzamide | CHEMBL58377
Type:
Small organic molecule
Emp. Form.:
C20H24FN3O2
Mol. Mass.:
357.4219
SMILES:
COc1ccccc1N1CCN(CCNC(=O)c2ccc(F)cc2)CC1
: